{"text_format":"3","workbook":"xlsx","n_sheets":6,"sheets":["VS Estimate","Base Data","Calculator","Action Required","CR Table","Data Validation"],"not_rendered":{"defined_names":1},"read":"whole","date_system":"1900"}

{"sheet":"VS Estimate","index":0,"n_rows":62,"n_cols":12,"rows_kept":62,"merged":[[6,2,6,11],[7,3,7,11],[10,3,10,11],[11,3,11,11],[12,3,12,11],[13,3,13,11],[14,3,14,11],[15,3,15,11],[17,2,17,11],[38,2,38,11],[41,2,41,10],[44,2,45,7],[47,2,48,9],[50,2,50,11],[51,2,51,11],[52,2,52,11],[53,2,53,11],[56,2,56,10]]}
[]
[]
[null,null,"University of Sussex Targeted Voluntary Severance Scheme 2021"]
[]
[null,null,"Estimate Your Voluntary Severance Pay"]
[]
[null,null,"Under the terms of the University of Sussex Targeted Voluntary Severance Scheme 2021, all eligible employees who are successful in their application for voluntary severance would receive a payment based on the following criteria:"]
[{"$nulls":3},"i. The Targeted Voluntary Severance payment will be based on the calculation of 2.75 weeks’ pay for each full year of service with the University of Sussex;\nii. Payments made under this scheme will be based on actual basic contractual pay at the point that the severance is agreed. This will exclude any other additional payments that may be made;\niii. The minimum Voluntary Severance payment will be 6 weeks contractual pay (pro rata for part-time staff, based on actual pay); \niv. Maximum service which may be taken into account under this scheme will be 22 years;\nv. The maximum number of weeks payable under this scheme will be 60.5 weeks;\nvi. The maximum amount for any Voluntary Severance payment will be capped at £99,000;\nvii. Weekly pay is calculated as annual basic contractual salary divided by 52.14.\n"]
[]
[null,null,"The following employees would not normally be allowed to leave under this policy:"]
[{"$nulls":3},"◦ those individuals who work outside of the targeted areas;"]
[{"$nulls":3},"◦ those individuals identified as critical to delivering operational requirements;"]
[{"$nulls":3},"◦ where an employee is already serving notice to leave for whatever reason;"]
[{"$nulls":3},"◦ where the number or combination of applicants will adversely affect the School/Division or wider University functions;"]
[{"$nulls":3},"◦ members of the University’s Executive Group or the University Leadership Team;"]
[{"$nulls":3},"◦ Staff who have resigned or who have declared in writing an intention to retire at any point after 1 Jan 2021."]
[]
[null,null,"Application to this scheme and benefits to be paid will require the approval of a specially convened panel chaired by the Vice-Chancellor or nominee which will consider applications in light of the University’s operational, business and strategic requirements. The decision to allow applications is at the discretion of the panel. Applications may or may not be approved and the panel decision will be final.  Voluntary Severance is paid wholly at the discretion of the University and there is no contractual right for an employee to receive a Voluntary Severance payment at any time."]
[]
[]
[null,null,"To calculate your Voluntary Severance Pay under this scheme, please enter the following details:"]
[]
[null,null,"What is your date of birth?"]
[{"$nulls":6},"January"]
[{"$nulls":6},"February"]
[{"$nulls":6},"March"]
[{"$nulls":6},"April"]
[{"$nulls":6},"May "]
[{"$nulls":6},"June"]
[{"$nulls":6},"July"]
[{"$nulls":6},"August"]
[{"$nulls":6},"September"]
[{"$nulls":6},"October"]
[{"$nulls":6},"November"]
[{"$nulls":6},"December"]
[{"$nulls":6},0]
[{"$nulls":3},"Day",null,"Month",null,"Year"]
[{"$nulls":6},0]
[null,null,"What date did you join the University? (for those employees with multiple contracts, this date is your continuous service date and is shown on Sussex Direct under Your Job)"]
[{"$nulls":3},"Day",null,"Month",null,"Year"]
{"$rows_left_out":23}
{"sheet":"Base Data","index":1,"n_rows":46,"n_cols":4,"rows_kept":46,"hidden":true}
["Base Data"]
[]
[]
[null,"Voluntary Severance Calculation:"]
[]
[null,"6.2.1 The Voluntary Severance payment will be based on the following criteria:"]
[null,"i) Payments made under this scheme will be based on actual basic contractual pay at the point that the severance is agreed. This will exclude any other additional payments that may be made."]
[null,"ii) The minimum VS payment will be four weeks contractual pay (pro rata for part-time staff – based on actual pay);"]
[null,"iii) VS pay will be based on contractual pay but using the statutory methodology for service along with a local UoS multiplier of 2.25"]
[null,"iv) maximum service which may be taken into account under this scheme will be 22 years"]
[null,"v) the maximum number of weeks payable under this scheme will be 49.5 weeks"]
[null,"vi) the maximum payment for any VS payment will be capped at £95,000."]
[null,"Weekly pay is calculated as annual basic contractual salary divided by",52.14]
[]
[null,"actual basic contractual pay"]
[null,"The minimum VS payment will be ",6,"weeks contractual pay "]
[null,"VS pay will be based on contractual pay but using the statutory methodology for service along with a local UoS multiplier of ",2.75]
[null,"iv) maximum service which may be taken into account under this scheme will be ",22,"years"]
[null,"v) the maximum number of weeks payable under this scheme will be ",60.5,"weeks"]
[null,"vi) the maximum payment for any VS payment will be capped at",{"v":99000,"d":"£99,000"}]
[]
[null,"CR Base Data"]
[null,"Weekly Earnings Cap limit",{"v":544,"d":"£544"}]
[null,"Annual Earnings Cap",{"$f":"C23*52","v":{"v":28288,"d":"£28,288"}}]
[null,"Monthly Earnings Cap",{"$f":"C24/12","v":{"v":2357.33333333333,"d":"£2,357"}}]
[]
[null,"CR Length of Service Cap",20,"Weeks"]
[]
[]
[null,"Voluntary Redundancy Calculation:"]
[]
[null,"6.2.1 The Voluntary redundancy payment will be based on the following criteria:"]
[null,"i) Payments made under this scheme will be based on actual basic contractual pay at the point that the redundancy is agreed. This will exclude any other additional payments that may be made."]
[null,"ii) The minimum VR payment will be two weeks contractual pay (pro rata for part-time staff – based on actual pay);"]
[null,"iii) VR pay will be based on contractual pay but using the statutory methodology for service along with a local UoS multiplier of 1.75"]
[null,"iv) maximum service which may be taken into account under this scheme will be 22 years"]
[null,"v) the maximum number of weeks payable under this scheme will be 38.5 weeks"]
[null,"vi) the maximum payment for any VS payment will be capped at £80,000."]
[null,"Weekly pay is calculated as annual basic contractual salary divided by",52.14]
[]
{"$rows_left_out":7}
{"sheet":"Calculator","index":2,"n_rows":7,"n_cols":57,"rows_kept":7,"hidden":true,"merged":[[3,17,3,26],[3,27,3,41],[3,42,3,56],[6,37,6,38],[6,52,6,53]]}
["VS Calculator"]
[]
[]
[null,"DOB",{"$nulls":4},"DOC",{"$nulls":4},"LDOS",{"$nulls":5},"CR Scheme",{"$nulls":9},"Targeted VS - Enhanced Scheme - 2.75 weeks multiplier, with cap on 22 years service and 60.5 weeks salary, with No Salary Cap Applied, with Minimum Payment of 6 weeks basic pay, subject to overall cap of £99,000",{"$nulls":14},"VR - Enhanced Scheme - 1.75 weeks multiplier, with cap on 22 years service and 38.5 weeks salary, with No Salary Cap Applied, with Minimum Payment of 2 weeks basic pay, subject to overall cap of £80,000"]
[null,"Day","Month (dddd)","Month (n)","Year","DOB","Day","Month (dddd)","Month (n)","Year","DOC","Day","Month (dddd)","Month (n)","Year","LDOS","Age on LDOS","Yrs Service at LDOS","LOS Cap","No of years for CR Purposes","Weeks Service Multiplier","Annual Salary","Weekly Salary","Capped Weekly Salary","Reference Salary","CR Redundancy Pay","Zero Checker","Yrs Service at LDOS","LOS Cap","No of years for VS Purposes","Weeks Service Multiplier","LOS Multiplier","Max number of weeks payable under Scheme","Multiplier for VS Purposes","Annual Salary","Weekly Salary","VS Sum(1)","Min no of Weeks","VS Sum(2)","VS Max","Max Payment Possible","VS Payment","Yrs Service at LDOS","LOS Cap","No of years for VS Purposes","Weeks Service Multiplier","LOS Multiplier","Max number of weeks payable under Scheme","Multiplier for VS Purposes","Annual Salary","Weekly Salary","VS Sum(1)","Min no of Weeks","VS Sum(2)","VS Max","Max Payment Possible","VS Payment"]
[null,{"$f":"'VS Estimate'!E37","v":0},{"$f":"'VS Estimate'!G37","v":0},{"$f":"VLOOKUP(C6,'Data Validation'!C4:D15,2,FALSE())","v":{"$error":"#N/A"}},{"$f":"'VS Estimate'!I37","v":0},{"$f":"DATE(E6,D6,B6)","v":{"$error":"#N/A"}},{"$f":"'VS Estimate'!E40","v":0},{"$f":"'VS Estimate'!G40","v":0},{"$f":"VLOOKUP(H6,'Data Validation'!C4:D15,2,FALSE())","v":{"$error":"#N/A"}},{"$f":"'VS Estimate'!I40","v":0},{"$f":"DATE(J6,I6,G6)","v":{"$error":"#N/A"}},{"$f":"'VS Estimate'!E43","v":0},{"$f":"'VS Estimate'!G43","v":0},{"$f":"VLOOKUP(M6,'Data Validation'!C4:D15,2,FALSE())","v":{"$error":"#N/A"}},{"$f":"'VS Estimate'!I43","v":0},{"$f":"DATE(O6,N6,L6)","v":{"$error":"#N/A"}},{"$f":"DATEDIF(F6,(P6+1),\"Y\")","v":{"$error":"#N/A"}},{"$f":"DATEDIF(K6,(P6+1),\"Y\")","v":{"$error":"#N/A"}},{"$f":"IF(R6=\"\",\"\",'Base Data'!C27)","v":{"$error":"#N/A"}},{"$f":"IF(R6<S6,R6,S6)","v":{"$error":"#N/A"}},{"$f":"IF(T6=\"\",\"\",IF(T6=0,0,INDEX('CR Table'!$A$3:$U$76, MATCH(Q6,'CR Table'!$A$3:$A$76,), MATCH(Calculator!T6,'CR Table'!$A$3:$U$3,))))","v":{"$error":"#N/A"}},{"$f":"'VS Estimate'!I45","v":0},{"$f":"IF(V6=\"\",\"\",V6/52)","v":0},{"$f":"IF(W6=\"\",\"\",'Base Data'!C23)","v":{"v":544,"d":"£544.00"}},{"$f":"IF(W6=\"\",\"\",IF(W6>X6,X6,W6))","v":0},{"$f":"IF(Y6=\"\",\"\",U6*Y6)","v":{"$error":"#N/A"}},{"$f":"IF(Z6=0,\"£            0\",Z6)","v":{"$error":"#N/A"}},{"$f":"R6","v":{"$error":"#N/A"}},{"$f":"'Base Data'!C18","v":22},{"$f":"IF(AB6<AC6,AB6,AC6)","v":{"$error":"#N/A"}},{"$f":"'Base Data'!C17","v":2.75},{"$f":"AD6*AE6","v":{"$error":"#N/A"}},{"$f":"'Base Data'!C19","v":60.5},{"$f":"IF(AF6<AG6,AF6,AG6)","v":{"$error":"#N/A"}},{"$f":"Calculator!V6","v":0},{"$f":"AI6/'Base Data'!C13","v":0},{"$f":"AH6*AJ6","v":{"$error":"#N/A"}},{"$f":"'Base Data'!C16","v":6},{"$f":"AJ6*AL6","v":0},{"$f":"MAX(AM6,AK6)","v":{"$error":"#N/A"}},{"$f":"'Base Data'!C20","v":{"v":99000,"d":"£99,000"}},{"$f":"MIN(AN6:AO6)","v":{"$error":"#N/A"}},{"$f":"R6","v":{"$error":"#N/A"}},{"$f":"'Base Data'!C44","v":22},{"$f":"IF(AQ6<AR6,AQ6,AR6)","v":{"$error":"#N/A"}},{"$f":"'Base Data'!C43","v":1.75},{"$f":"AS6*AT6","v":{"$error":"#N/A"}},{"$f":"'Base Data'!C45","v":38.5},{"$f":"IF(AU6<AV6,AU6,AV6)","v":{"$error":"#N/A"}},{"$f":"Calculator!V6","v":0},{"$f":"AX6/'Base Data'!C39","v":0},{"$f":"AW6*AY6","v":{"$error":"#N/A"}},{"$f":"'Base Data'!C42","v":2},{"$f":"AY6*BA6","v":0},{"$f":"MAX(BB6,AZ6)","v":{"$error":"#N/A"}},{"$f":"'Base Data'!C46","v":{"v":80000,"d":"£80,000"}},{"$f":"MIN(BC6:BD6)","v":{"$error":"#N/A"}}]
[{"$nulls":37},"Min Payment ",{"$nulls":14},"Min Payment "]

{"sheet":"Action Required","index":3,"n_rows":19,"n_cols":3,"rows_kept":19,"hidden":true}
["Action Required"]
[]
["Update Terms of the Scheme"]
[null,"Base Data"]
[null,"Descriptions in "]
[null,null,"VS Estimate"]
[null,null,"Base Data"]
[null,null,"Calculator"]
["Protect All Sheets"]
[null,"Password ","**HRVS**"]
[null,"Hide Sheets"]
[null,null,"Base Data"]
[null,null,"Calculator"]
[null,null,"Action Required"]
["Protect Workbook"]
["Test calculator"]
["Save as Excel Template"]
["Test"]
["Copy to ITS to upload onto Sussex Direct"]

{"sheet":"CR Table","index":4,"n_rows":79,"n_cols":21,"rows_kept":79,"hidden":true}
["Compulsory Redundancy Age LOS table"]
[null,"Length of Service (in years)"]
["Age",1,2,3,4,5,6,7,8,9,10,11,12,13,14,15,16,17,18,19,20]
[18,{"v":0,"d":"0.00"},{"v":1,"d":"1.00"},{"v":1.5,"d":"1.50"},{"v":2,"d":"2.00"}]
[19,{"v":0,"d":"0.00"},{"v":1,"d":"1.00"},{"v":1.5,"d":"1.50"},{"v":2,"d":"2.00"},{"v":2.5,"d":"2.50"}]
[20,{"v":0,"d":"0.00"},{"v":1,"d":"1.00"},{"v":1.5,"d":"1.50"},{"v":2,"d":"2.00"},{"v":2.5,"d":"2.50"},{"v":3,"d":"3.00"}]
[21,{"v":0,"d":"0.00"},{"v":1,"d":"1.00"},{"v":1.5,"d":"1.50"},{"v":2,"d":"2.00"},{"v":2.5,"d":"2.50"},{"v":3,"d":"3.00"},{"v":3.5,"d":"3.50"}]
[22,{"v":0,"d":"0.00"},{"v":1,"d":"1.00"},{"v":1.5,"d":"1.50"},{"v":2,"d":"2.00"},{"v":2.5,"d":"2.50"},{"v":3,"d":"3.00"},{"v":3.5,"d":"3.50"},{"v":4,"d":"4.00"}]
[23,{"v":0,"d":"0.00"},{"v":1.5,"d":"1.50"},{"v":2,"d":"2.00"},{"v":2.5,"d":"2.50"},{"v":3,"d":"3.00"},{"v":3.5,"d":"3.50"},{"v":4,"d":"4.00"},{"v":4.5,"d":"4.50"},{"v":5,"d":"5.00"}]
[24,{"v":0,"d":"0.00"},{"v":2,"d":"2.00"},{"v":2.5,"d":"2.50"},{"v":3,"d":"3.00"},{"v":3.5,"d":"3.50"},{"v":4,"d":"4.00"},{"v":4.5,"d":"4.50"},{"v":5,"d":"5.00"},{"v":5.5,"d":"5.50"},{"v":6,"d":"6.00"}]
[25,{"v":0,"d":"0.00"},{"v":2,"d":"2.00"},{"v":3,"d":"3.00"},{"v":3.5,"d":"3.50"},{"v":4,"d":"4.00"},{"v":4.5,"d":"4.50"},{"v":5,"d":"5.00"},{"v":5.5,"d":"5.50"},{"v":6,"d":"6.00"},{"v":6.5,"d":"6.50"},{"v":7,"d":"7.00"}]
[26,{"v":0,"d":"0.00"},{"v":2,"d":"2.00"},{"v":3,"d":"3.00"},{"v":4,"d":"4.00"},{"v":4.5,"d":"4.50"},{"v":5,"d":"5.00"},{"v":5.5,"d":"5.50"},{"v":6,"d":"6.00"},{"v":6.5,"d":"6.50"},{"v":7,"d":"7.00"},{"v":7.5,"d":"7.50"},{"v":8,"d":"8.00"}]
[27,{"v":0,"d":"0.00"},{"v":2,"d":"2.00"},{"v":3,"d":"3.00"},{"v":4,"d":"4.00"},{"v":5,"d":"5.00"},{"v":5.5,"d":"5.50"},{"v":6,"d":"6.00"},{"v":6.5,"d":"6.50"},{"v":7,"d":"7.00"},{"v":7.5,"d":"7.50"},{"v":8,"d":"8.00"},{"v":8.5,"d":"8.50"},{"v":9,"d":"9.00"}]
[28,{"v":0,"d":"0.00"},{"v":2,"d":"2.00"},{"v":3,"d":"3.00"},{"v":4,"d":"4.00"},{"v":5,"d":"5.00"},{"v":6,"d":"6.00"},{"v":6.5,"d":"6.50"},{"v":7,"d":"7.00"},{"v":7.5,"d":"7.50"},{"v":8,"d":"8.00"},{"v":8.5,"d":"8.50"},{"v":9,"d":"9.00"},{"v":9.5,"d":"9.50"},{"v":10,"d":"10.00"}]
[29,{"v":0,"d":"0.00"},{"v":2,"d":"2.00"},{"v":3,"d":"3.00"},{"v":4,"d":"4.00"},{"v":5,"d":"5.00"},{"v":6,"d":"6.00"},{"v":7,"d":"7.00"},{"v":7.5,"d":"7.50"},{"v":8,"d":"8.00"},{"v":8.5,"d":"8.50"},{"v":9,"d":"9.00"},{"v":9.5,"d":"9.50"},{"v":10,"d":"10.00"},{"v":10.5,"d":"10.50"},{"v":11,"d":"11.00"}]
[30,{"v":0,"d":"0.00"},{"v":2,"d":"2.00"},{"v":3,"d":"3.00"},{"v":4,"d":"4.00"},{"v":5,"d":"5.00"},{"v":6,"d":"6.00"},{"v":7,"d":"7.00"},{"v":8,"d":"8.00"},{"v":8.5,"d":"8.50"},{"v":9,"d":"9.00"},{"v":9.5,"d":"9.50"},{"v":10,"d":"10.00"},{"v":10.5,"d":"10.50"},{"v":11,"d":"11.00"},{"v":11.5,"d":"11.50"},{"v":12,"d":"12.00"}]
[31,{"v":0,"d":"0.00"},{"v":2,"d":"2.00"},{"v":3,"d":"3.00"},{"v":4,"d":"4.00"},{"v":5,"d":"5.00"},{"v":6,"d":"6.00"},{"v":7,"d":"7.00"},{"v":8,"d":"8.00"},{"v":9,"d":"9.00"},{"v":9.5,"d":"9.50"},{"v":10,"d":"10.00"},{"v":10.5,"d":"10.50"},{"v":11,"d":"11.00"},{"v":11.5,"d":"11.50"},{"v":12,"d":"12.00"},{"v":12.5,"d":"12.50"},{"v":13,"d":"13.00"}]
[32,{"v":0,"d":"0.00"},{"v":2,"d":"2.00"},{"v":3,"d":"3.00"},{"v":4,"d":"4.00"},{"v":5,"d":"5.00"},{"v":6,"d":"6.00"},{"v":7,"d":"7.00"},{"v":8,"d":"8.00"},{"v":9,"d":"9.00"},{"v":10,"d":"10.00"},{"v":10.5,"d":"10.50"},{"v":11,"d":"11.00"},{"v":11.5,"d":"11.50"},{"v":12,"d":"12.00"},{"v":12.5,"d":"12.50"},{"v":13,"d":"13.00"},{"v":13.5,"d":"13.50"},{"v":14,"d":"14.00"}]
[33,{"v":0,"d":"0.00"},{"v":2,"d":"2.00"},{"v":3,"d":"3.00"},{"v":4,"d":"4.00"},{"v":5,"d":"5.00"},{"v":6,"d":"6.00"},{"v":7,"d":"7.00"},{"v":8,"d":"8.00"},{"v":9,"d":"9.00"},{"v":10,"d":"10.00"},{"v":11,"d":"11.00"},{"v":11.5,"d":"11.50"},{"v":12,"d":"12.00"},{"v":12.5,"d":"12.50"},{"v":13,"d":"13.00"},{"v":13.5,"d":"13.50"},{"v":14,"d":"14.00"},{"v":14.5,"d":"14.50"},{"v":15,"d":"15.00"}]
[34,{"v":0,"d":"0.00"},{"v":2,"d":"2.00"},{"v":3,"d":"3.00"},{"v":4,"d":"4.00"},{"v":5,"d":"5.00"},{"v":6,"d":"6.00"},{"v":7,"d":"7.00"},{"v":8,"d":"8.00"},{"v":9,"d":"9.00"},{"v":10,"d":"10.00"},{"v":11,"d":"11.00"},{"v":12,"d":"12.00"},{"v":12.5,"d":"12.50"},{"v":13,"d":"13.00"},{"v":13.5,"d":"13.50"},{"v":14,"d":"14.00"},{"v":14.5,"d":"14.50"},{"v":15,"d":"15.00"},{"v":15.5,"d":"15.50"},{"v":16,"d":"16.00"}]
[35,{"v":0,"d":"0.00"},{"v":2,"d":"2.00"},{"v":3,"d":"3.00"},{"v":4,"d":"4.00"},{"v":5,"d":"5.00"},{"v":6,"d":"6.00"},{"v":7,"d":"7.00"},{"v":8,"d":"8.00"},{"v":9,"d":"9.00"},{"v":10,"d":"10.00"},{"v":11,"d":"11.00"},{"v":12,"d":"12.00"},{"v":13,"d":"13.00"},{"v":13.5,"d":"13.50"},{"v":14,"d":"14.00"},{"v":14.5,"d":"14.50"},{"v":15,"d":"15.00"},{"v":15.5,"d":"15.50"},{"v":16,"d":"16.00"},{"v":16.5,"d":"16.50"}]
[36,{"v":0,"d":"0.00"},{"v":2,"d":"2.00"},{"v":3,"d":"3.00"},{"v":4,"d":"4.00"},{"v":5,"d":"5.00"},{"v":6,"d":"6.00"},{"v":7,"d":"7.00"},{"v":8,"d":"8.00"},{"v":9,"d":"9.00"},{"v":10,"d":"10.00"},{"v":11,"d":"11.00"},{"v":12,"d":"12.00"},{"v":13,"d":"13.00"},{"v":14,"d":"14.00"},{"v":14.5,"d":"14.50"},{"v":15,"d":"15.00"},{"v":15.5,"d":"15.50"},{"v":16,"d":"16.00"},{"v":16.5,"d":"16.50"},{"v":17,"d":"17.00"}]
[37,{"v":0,"d":"0.00"},{"v":2,"d":"2.00"},{"v":3,"d":"3.00"},{"v":4,"d":"4.00"},{"v":5,"d":"5.00"},{"v":6,"d":"6.00"},{"v":7,"d":"7.00"},{"v":8,"d":"8.00"},{"v":9,"d":"9.00"},{"v":10,"d":"10.00"},{"v":11,"d":"11.00"},{"v":12,"d":"12.00"},{"v":13,"d":"13.00"},{"v":14,"d":"14.00"},{"v":15,"d":"15.00"},{"v":15.5,"d":"15.50"},{"v":16,"d":"16.00"},{"v":16.5,"d":"16.50"},{"v":17,"d":"17.00"},{"v":17.5,"d":"17.50"}]
[38,{"v":0,"d":"0.00"},{"v":2,"d":"2.00"},{"v":3,"d":"3.00"},{"v":4,"d":"4.00"},{"v":5,"d":"5.00"},{"v":6,"d":"6.00"},{"v":7,"d":"7.00"},{"v":8,"d":"8.00"},{"v":9,"d":"9.00"},{"v":10,"d":"10.00"},{"v":11,"d":"11.00"},{"v":12,"d":"12.00"},{"v":13,"d":"13.00"},{"v":14,"d":"14.00"},{"v":15,"d":"15.00"},{"v":16,"d":"16.00"},{"v":16.5,"d":"16.50"},{"v":17,"d":"17.00"},{"v":17.5,"d":"17.50"},{"v":18,"d":"18.00"}]
[39,{"v":0,"d":"0.00"},{"v":2,"d":"2.00"},{"v":3,"d":"3.00"},{"v":4,"d":"4.00"},{"v":5,"d":"5.00"},{"v":6,"d":"6.00"},{"v":7,"d":"7.00"},{"v":8,"d":"8.00"},{"v":9,"d":"9.00"},{"v":10,"d":"10.00"},{"v":11,"d":"11.00"},{"v":12,"d":"12.00"},{"v":13,"d":"13.00"},{"v":14,"d":"14.00"},{"v":15,"d":"15.00"},{"v":16,"d":"16.00"},{"v":17,"d":"17.00"},{"v":17.5,"d":"17.50"},{"v":18,"d":"18.00"},{"v":18.5,"d":"18.50"}]
[40,{"v":0,"d":"0.00"},{"v":2,"d":"2.00"},{"v":3,"d":"3.00"},{"v":4,"d":"4.00"},{"v":5,"d":"5.00"},{"v":6,"d":"6.00"},{"v":7,"d":"7.00"},{"v":8,"d":"8.00"},{"v":9,"d":"9.00"},{"v":10,"d":"10.00"},{"v":11,"d":"11.00"},{"v":12,"d":"12.00"},{"v":13,"d":"13.00"},{"v":14,"d":"14.00"},{"v":15,"d":"15.00"},{"v":16,"d":"16.00"},{"v":17,"d":"17.00"},{"v":18,"d":"18.00"},{"v":18.5,"d":"18.50"},{"v":19,"d":"19.00"}]
[41,{"v":0,"d":"0.00"},{"v":2,"d":"2.00"},{"v":3,"d":"3.00"},{"v":4,"d":"4.00"},{"v":5,"d":"5.00"},{"v":6,"d":"6.00"},{"v":7,"d":"7.00"},{"v":8,"d":"8.00"},{"v":9,"d":"9.00"},{"v":10,"d":"10.00"},{"v":11,"d":"11.00"},{"v":12,"d":"12.00"},{"v":13,"d":"13.00"},{"v":14,"d":"14.00"},{"v":15,"d":"15.00"},{"v":16,"d":"16.00"},{"v":17,"d":"17.00"},{"v":18,"d":"18.00"},{"v":19,"d":"19.00"},{"v":19.5,"d":"19.50"}]
[42,{"v":0,"d":"0.00"},{"v":2.5,"d":"2.50"},{"v":3.5,"d":"3.50"},{"v":4.5,"d":"4.50"},{"v":5.5,"d":"5.50"},{"v":6.5,"d":"6.50"},{"v":7.5,"d":"7.50"},{"v":8.5,"d":"8.50"},{"v":9.5,"d":"9.50"},{"v":10.5,"d":"10.50"},{"v":11.5,"d":"11.50"},{"v":12.5,"d":"12.50"},{"v":13.5,"d":"13.50"},{"v":14.5,"d":"14.50"},{"v":15.5,"d":"15.50"},{"v":16.5,"d":"16.50"},{"v":17.5,"d":"17.50"},{"v":18.5,"d":"18.50"},{"v":19.5,"d":"19.50"},{"v":20.5,"d":"20.50"}]
[43,{"v":0,"d":"0.00"},{"v":3,"d":"3.00"},{"v":4,"d":"4.00"},{"v":5,"d":"5.00"},{"v":6,"d":"6.00"},{"v":7,"d":"7.00"},{"v":8,"d":"8.00"},{"v":9,"d":"9.00"},{"v":10,"d":"10.00"},{"v":11,"d":"11.00"},{"v":12,"d":"12.00"},{"v":13,"d":"13.00"},{"v":14,"d":"14.00"},{"v":15,"d":"15.00"},{"v":16,"d":"16.00"},{"v":17,"d":"17.00"},{"v":18,"d":"18.00"},{"v":19,"d":"19.00"},{"v":20,"d":"20.00"},{"v":21,"d":"21.00"}]
[44,{"v":0,"d":"0.00"},{"v":3,"d":"3.00"},{"v":4.5,"d":"4.50"},{"v":5.5,"d":"5.50"},{"v":6.5,"d":"6.50"},{"v":7.5,"d":"7.50"},{"v":8.5,"d":"8.50"},{"v":9.5,"d":"9.50"},{"v":10.5,"d":"10.50"},{"v":11.5,"d":"11.50"},{"v":12.5,"d":"12.50"},{"v":13.5,"d":"13.50"},{"v":14.5,"d":"14.50"},{"v":15.5,"d":"15.50"},{"v":16.5,"d":"16.50"},{"v":17.5,"d":"17.50"},{"v":18.5,"d":"18.50"},{"v":19.5,"d":"19.50"},{"v":20.5,"d":"20.50"},{"v":21.5,"d":"21.50"}]
[45,{"v":0,"d":"0.00"},{"v":3,"d":"3.00"},{"v":4.5,"d":"4.50"},{"v":6,"d":"6.00"},{"v":7,"d":"7.00"},{"v":8,"d":"8.00"},{"v":9,"d":"9.00"},{"v":10,"d":"10.00"},{"v":11,"d":"11.00"},{"v":12,"d":"12.00"},{"v":13,"d":"13.00"},{"v":14,"d":"14.00"},{"v":15,"d":"15.00"},{"v":16,"d":"16.00"},{"v":17,"d":"17.00"},{"v":18,"d":"18.00"},{"v":19,"d":"19.00"},{"v":20,"d":"20.00"},{"v":21,"d":"21.00"},{"v":22,"d":"22.00"}]
[46,{"v":0,"d":"0.00"},{"v":3,"d":"3.00"},{"v":4.5,"d":"4.50"},{"v":6,"d":"6.00"},{"v":7.5,"d":"7.50"},{"v":8.5,"d":"8.50"},{"v":9.5,"d":"9.50"},{"v":10.5,"d":"10.50"},{"v":11.5,"d":"11.50"},{"v":12.5,"d":"12.50"},{"v":13.5,"d":"13.50"},{"v":14.5,"d":"14.50"},{"v":15.5,"d":"15.50"},{"v":16.5,"d":"16.50"},{"v":17.5,"d":"17.50"},{"v":18.5,"d":"18.50"},{"v":19.5,"d":"19.50"},{"v":20.5,"d":"20.50"},{"v":21.5,"d":"21.50"},{"v":22.5,"d":"22.50"}]
[47,{"v":0,"d":"0.00"},{"v":3,"d":"3.00"},{"v":4.5,"d":"4.50"},{"v":6,"d":"6.00"},{"v":7.5,"d":"7.50"},{"v":9,"d":"9.00"},{"v":10,"d":"10.00"},{"v":11,"d":"11.00"},{"v":12,"d":"12.00"},{"v":13,"d":"13.00"},{"v":14,"d":"14.00"},{"v":15,"d":"15.00"},{"v":16,"d":"16.00"},{"v":17,"d":"17.00"},{"v":18,"d":"18.00"},{"v":19,"d":"19.00"},{"v":20,"d":"20.00"},{"v":21,"d":"21.00"},{"v":22,"d":"22.00"},{"v":23,"d":"23.00"}]
[48,{"v":0,"d":"0.00"},{"v":3,"d":"3.00"},{"v":4.5,"d":"4.50"},{"v":6,"d":"6.00"},{"v":7.5,"d":"7.50"},{"v":9,"d":"9.00"},{"v":10.5,"d":"10.50"},{"v":11.5,"d":"11.50"},{"v":12.5,"d":"12.50"},{"v":13.5,"d":"13.50"},{"v":14.5,"d":"14.50"},{"v":15.5,"d":"15.50"},{"v":16.5,"d":"16.50"},{"v":17.5,"d":"17.50"},{"v":18.5,"d":"18.50"},{"v":19.5,"d":"19.50"},{"v":20.5,"d":"20.50"},{"v":21.5,"d":"21.50"},{"v":22.5,"d":"22.50"},{"v":23.5,"d":"23.50"}]
[49,{"v":0,"d":"0.00"},{"v":3,"d":"3.00"},{"v":4.5,"d":"4.50"},{"v":6,"d":"6.00"},{"v":7.5,"d":"7.50"},{"v":9,"d":"9.00"},{"v":10.5,"d":"10.50"},{"v":12,"d":"12.00"},{"v":13,"d":"13.00"},{"v":14,"d":"14.00"},{"v":15,"d":"15.00"},{"v":16,"d":"16.00"},{"v":17,"d":"17.00"},{"v":18,"d":"18.00"},{"v":19,"d":"19.00"},{"v":20,"d":"20.00"},{"v":21,"d":"21.00"},{"v":22,"d":"22.00"},{"v":23,"d":"23.00"},{"v":24,"d":"24.00"}]
[50,{"v":0,"d":"0.00"},{"v":3,"d":"3.00"},{"v":4.5,"d":"4.50"},{"v":6,"d":"6.00"},{"v":7.5,"d":"7.50"},{"v":9,"d":"9.00"},{"v":10.5,"d":"10.50"},{"v":12,"d":"12.00"},{"v":13.5,"d":"13.50"},{"v":14.5,"d":"14.50"},{"v":15.5,"d":"15.50"},{"v":16.5,"d":"16.50"},{"v":17.5,"d":"17.50"},{"v":18.5,"d":"18.50"},{"v":19.5,"d":"19.50"},{"v":20.5,"d":"20.50"},{"v":21.5,"d":"21.50"},{"v":22.5,"d":"22.50"},{"v":23.5,"d":"23.50"},{"v":24.5,"d":"24.50"}]
[51,{"v":0,"d":"0.00"},{"v":3,"d":"3.00"},{"v":4.5,"d":"4.50"},{"v":6,"d":"6.00"},{"v":7.5,"d":"7.50"},{"v":9,"d":"9.00"},{"v":10.5,"d":"10.50"},{"v":12,"d":"12.00"},{"v":13.5,"d":"13.50"},{"v":15,"d":"15.00"},{"v":16,"d":"16.00"},{"v":17,"d":"17.00"},{"v":18,"d":"18.00"},{"v":19,"d":"19.00"},{"v":20,"d":"20.00"},{"v":21,"d":"21.00"},{"v":22,"d":"22.00"},{"v":23,"d":"23.00"},{"v":24,"d":"24.00"},{"v":25,"d":"25.00"}]
[52,{"v":0,"d":"0.00"},{"v":3,"d":"3.00"},{"v":4.5,"d":"4.50"},{"v":6,"d":"6.00"},{"v":7.5,"d":"7.50"},{"v":9,"d":"9.00"},{"v":10.5,"d":"10.50"},{"v":12,"d":"12.00"},{"v":13.5,"d":"13.50"},{"v":15,"d":"15.00"},{"v":16.5,"d":"16.50"},{"v":17.5,"d":"17.50"},{"v":18.5,"d":"18.50"},{"v":19.5,"d":"19.50"},{"v":20.5,"d":"20.50"},{"v":21.5,"d":"21.50"},{"v":22.5,"d":"22.50"},{"v":23.5,"d":"23.50"},{"v":24.5,"d":"24.50"},{"v":25.5,"d":"25.50"}]
[53,{"v":0,"d":"0.00"},{"v":3,"d":"3.00"},{"v":4.5,"d":"4.50"},{"v":6,"d":"6.00"},{"v":7.5,"d":"7.50"},{"v":9,"d":"9.00"},{"v":10.5,"d":"10.50"},{"v":12,"d":"12.00"},{"v":13.5,"d":"13.50"},{"v":15,"d":"15.00"},{"v":16.5,"d":"16.50"},{"v":18,"d":"18.00"},{"v":19,"d":"19.00"},{"v":20,"d":"20.00"},{"v":21,"d":"21.00"},{"v":22,"d":"22.00"},{"v":23,"d":"23.00"},{"v":24,"d":"24.00"},{"v":25,"d":"25.00"},{"v":26,"d":"26.00"}]
[54,{"v":0,"d":"0.00"},{"v":3,"d":"3.00"},{"v":4.5,"d":"4.50"},{"v":6,"d":"6.00"},{"v":7.5,"d":"7.50"},{"v":9,"d":"9.00"},{"v":10.5,"d":"10.50"},{"v":12,"d":"12.00"},{"v":13.5,"d":"13.50"},{"v":15,"d":"15.00"},{"v":16.5,"d":"16.50"},{"v":18,"d":"18.00"},{"v":19.5,"d":"19.50"},{"v":20.5,"d":"20.50"},{"v":21.5,"d":"21.50"},{"v":22.5,"d":"22.50"},{"v":23.5,"d":"23.50"},{"v":24.5,"d":"24.50"},{"v":25.5,"d":"25.50"},{"v":26.5,"d":"26.50"}]
{"$rows_left_out":40}
{"sheet":"Data Validation","index":5,"n_rows":126,"n_cols":5,"rows_kept":126,"hidden":true}
["Data Validation"]
[]
[null,"Date","Month",null,"Year"]
[null,1,"January",1,2022]
[null,2,"February",2,2021]
[null,3,"March",3,2020]
[null,4,"April",4,2019]
[null,5,"May",5,2018]
[null,6,"June",6,2017]
[null,7,"July",7,2016]
[null,8,"August",8,2015]
[null,9,"September",9,2014]
[null,10,"October",10,2013]
[null,11,"November",11,2012]
[null,12,"December",12,2011]
[null,13,null,null,2010]
[null,14,null,null,2009]
[null,15,null,null,2008]
[null,16,null,null,2007]
[null,17,null,null,2006]
[null,18,null,null,2005]
[null,19,null,null,2004]
[null,20,null,null,2003]
[null,21,null,null,2002]
[null,22,null,null,2001]
[null,23,null,null,2000]
[null,24,null,null,1999]
[null,25,null,null,1998]
[null,26,null,null,1997]
[null,27,null,null,1996]
[null,28,null,null,1995]
[null,29,null,null,1994]
[null,30,null,null,1993]
[null,31,null,null,1992]
[{"$nulls":4},1991]
[{"$nulls":4},1990]
[{"$nulls":4},1989]
[{"$nulls":4},1988]
[{"$nulls":4},1987]
[{"$nulls":4},1986]
{"$rows_left_out":86}